Attachment 'sigrok_Ubuntu1604-32_git-test.txt'

Download

   1 File: sigrok_Ubuntu1604-32_git-test.txt  2016-09-13 16:15
   2 Rudolf Reuter
   3 Bug 650 - PulseView cannot find my Saleae Logic16 clone on Windows 7
   4 http://sigrok.org/bugzilla/show_bug.cgi?id=650
   5 
   6 Test of compile:
   7 $ LD_LIBRARY_PATH=$HOME/sr/lib $HOME/sr/bin/pulseview -l 5
   8 bash: /home/rudi/sr/bin/pulseview: Datei oder Verzeichnis nicht gefunden
   9 
  10 Compile run:
  11 rudi@rudi-VB-U1604-32:~/Install$ ./cross-compile_linux_sigrok-cross-linux.sh 
  12 Klone nach 'libserialport' ...
  13 remote: Counting objects: 24, done.
  14 remote: Compressing objects: 100% (24/24), done.
  15 remote: Total 24 (delta 1), reused 1 (delta 0)
  16 Empfange Objekte: 100% (24/24), 78.13 KiB | 0 bytes/s, Fertig.
  17 Löse Unterschiede auf: 100% (1/1), Fertig.
  18 Prüfe Konnektivität ... Fertig.
  19 autoreconf: Entering directory `.'
  20 autoreconf: configure.ac: not using Gettext
  21 autoreconf: running: aclocal --force -I autostuff
  22 autoreconf: configure.ac: tracing
  23 autoreconf: running: libtoolize --copy --force
  24 libtoolize: putting auxiliary files in AC_CONFIG_AUX_DIR, 'autostuff'.
  25 libtoolize: copying file 'autostuff/ltmain.sh'ferror
  26 libtoolize: putting macros in AC_CONFIG_MACRO_DIRS, 'autostuff'.
  27 libtoolize: copying file 'autostuff/libtool.m4'
  28 libtoolize: copying file 'autostuff/ltoptions.m4'
  29 libtoolize: copying file 'autostuff/ltsugar.m4'
  30 libtoolize: copying file 'autostuff/ltversion.m4'
  31 libtoolize: copying file 'autostuff/lt~obsolete.m4'
  32 autoreconf: running: /usr/bin/autoconf --force
  33 autoreconf: running: /usr/bin/autoheader --force
  34 autoreconf: running: automake --add-missing --copy --force-missing
  35 configure.ac:46: installing 'autostuff/ar-lib'
  36 configure.ac:46: installing 'autostuff/compile'
  37 configure.ac:54: installing 'autostuff/config.guess'
  38 configure.ac:54: installing 'autostuff/config.sub'
  39 configure.ac:44: installing 'autostuff/install-sh'
  40 configure.ac:44: installing 'autostuff/missing'
  41 Makefile.am: installing './INSTALL'
  42 Makefile.am: installing 'autostuff/depcomp'
  43 autoreconf: Leaving directory `.'
  44 checking for a BSD-compatible install... /usr/bin/install -c
  45 checking whether build environment is sane... yes
  46 checking for a thread-safe mkdir -p... /bin/mkdir -p
  47 checking for gawk... no
  48 checking for mawk... mawk
  49 checking whether make sets $(MAKE)... yes
  50 checking whether make supports nested variables... yes
  51 checking whether make supports nested variables... (cached) yes
  52 checking for style of include used by make... GNU
  53 checking for gcc... gcc
  54 checking whether the C compiler works... yes
  55 checking for C compiler default output file name... a.out
  56 checking for suffix of executables... 
  57 checking whether we are cross compiling... no
  58 checking for suffix of object files... o
  59 checking whether we are using the GNU C compiler... yes
  60 checking whether gcc accepts -g... yes
  61 checking for gcc option to accept ISO C89... none needed
  62 checking whether gcc understands -c and -o together... yes
  63 checking dependency style of gcc... gcc3
  64 checking for ar... ar
  65 checking the archiver (ar) interface... ar
  66 checking for gcc... (cached) gcc
  67 checking whether we are using the GNU C compiler... (cached) yes
  68 checking whether gcc accepts -g... (cached) yes
  69 checking for gcc option to accept ISO C89... (cached) none needed
  70 checking whether gcc understands -c and -o together... (cached) yes
  71 checking dependency style of gcc... (cached) gcc3
  72 checking whether ln -s works... yes
  73 checking build system type... i686-pc-linux-gnu
  74 checking host system type... i686-pc-linux-gnu
  75 checking how to print strings... printf
  76 checking for a sed that does not truncate output... /bin/sed
  77 checking for grep that handles long lines and -e... /bin/grep
  78 checking for egrep... /bin/grep -E
  79 checking for fgrep... /bin/grep -F
  80 checking for ld used by gcc... /usr/bin/ld
  81 checking if the linker (/usr/bin/ld) is GNU ld... yes
  82 checking for BSD- or MS-compatible name lister (nm)... /usr/bin/nm -B
  83 checking the name lister (/usr/bin/nm -B) interface... BSD nm
  84 checking the maximum length of command line arguments... 1572864
  85 checking how to convert i686-pc-linux-gnu file names to i686-pc-linux-gnu format... func_convert_file_noop
  86 checking how to convert i686-pc-linux-gnu file names to toolchain format... func_convert_file_noop
  87 checking for /usr/bin/ld option to reload object files... -r
  88 checking for objdump... objdump
  89 checking how to recognize dependent libraries... pass_all
  90 checking for dlltool... no
  91 checking how to associate runtime and link libraries... printf %s\n
  92 checking for archiver @FILE support... @
  93 checking for strip... strip
  94 checking for ranlib... ranlib
  95 checking command to parse /usr/bin/nm -B output from gcc object... ok
  96 checking for sysroot... no
  97 checking for a working dd... /bin/dd
  98 checking how to truncate binary pipes... /bin/dd bs=4096 count=1
  99 checking for mt... mt
 100 checking if mt is a manifest tool... no
 101 checking how to run the C preprocessor... gcc -E
 102 checking for ANSI C header files... yes
 103 checking for sys/types.h... yes
 104 checking for sys/stat.h... yes
 105 checking for stdlib.h... yes
 106 checking for string.h... yes
 107 checking for memory.h... yes
 108 checking for strings.h... yes
 109 checking for inttypes.h... yes
 110 checking for stdint.h... yes
 111 checking for unistd.h... yes
 112 checking for dlfcn.h... yes
 113 checking for objdir... .libs
 114 checking if gcc supports -fno-rtti -fno-exceptions... no
 115 checking for gcc option to produce PIC... -fPIC -DPIC
 116 checking if gcc PIC flag -fPIC -DPIC works... yes
 117 checking if gcc static flag -static works... yes
 118 checking if gcc supports -c -o file.o... yes
 119 checking if gcc supports -c -o file.o... (cached) yes
 120 checking whether the gcc linker (/usr/bin/ld) supports shared libraries... yes
 121 checking whether -lc should be explicitly linked in... no
 122 checking dynamic linker characteristics... GNU/Linux ld.so
 123 checking how to hardcode library paths into programs... immediate
 124 checking whether stripping libraries is possible... yes
 125 checking if libtool supports shared libraries... yes
 126 checking whether to build shared libraries... yes
 127 checking whether to build static libraries... yes
 128 checking for special C compiler options needed for large files... no
 129 checking for _FILE_OFFSET_BITS value needed for large files... 64
 130 checking for size_t... yes
 131 checking for struct termios2... yes
 132 checking for struct termiox... yes
 133 checking for struct termios.c_ispeed... no
 134 checking for struct termios.c_ospeed... no
 135 checking for struct termios2.c_ispeed... yes
 136 checking for struct termios2.c_ospeed... yes
 137 checking whether BOTHER is declared... yes
 138 checking for struct serial_struct... yes
 139 checking for visibility control... attribute
 140 checking that generated files are newer than configure... done
 141 configure: creating ./config.status
 142 config.status: creating Makefile
 143 config.status: creating libserialport.pc
 144 config.status: creating config.h
 145 config.status: creating libserialport.h
 146 config.status: executing depfiles commands
 147 config.status: executing libtool commands
 148 
 149 libserialport configuration summary:
 150 
 151  - Package version (major.minor.micro):    0.1.1
 152  - Library version (current:revision:age): 1:0:1
 153  - Prefix: /home/rudi/sr
 154  - Building on:  i686-pc-linux-gnu
 155  - Building for: i686-pc-linux-gnu
 156 
 157 make  all-am
 158   CC       serialport.lo
 159   CC       linux.lo
 160   CC       linux_termios.lo
 161   CCLD     libserialport.la
 162 ar: `u' modifier ignored since `D' is the default (see `U')
 163  /bin/mkdir -p '/home/rudi/sr/lib'
 164  /bin/bash ./libtool --silent  --mode=install /usr/bin/install -c   libserialport.la '/home/rudi/sr/lib'
 165  /bin/mkdir -p '/home/rudi/sr/include'
 166  /usr/bin/install -c -m 644 libserialport.h '/home/rudi/sr/include'
 167  /bin/mkdir -p '/home/rudi/sr/lib/pkgconfig'
 168  /usr/bin/install -c -m 644 libserialport.pc '/home/rudi/sr/lib/pkgconfig'
 169 Klone nach 'libsigrok' ...
 170 remote: Counting objects: 398, done.
 171 remote: Compressing objects: 100% (377/377), done.
 172 remote: Total 398 (delta 76), reused 110 (delta 10)
 173 Empfange Objekte: 100% (398/398), 865.29 KiB | 635.00 KiB/s, Fertig.
 174 Löse Unterschiede auf: 100% (76/76), Fertig.
 175 Prüfe Konnektivität ... Fertig.
 176 autoreconf: Entering directory `.'
 177 autoreconf: configure.ac: not using Gettext
 178 autoreconf: running: aclocal --force -I m4
 179 autoreconf: configure.ac: tracing
 180 autoreconf: configure.ac: creating directory autostuff
 181 autoreconf: running: libtoolize --copy --force
 182 libtoolize: putting auxiliary files in AC_CONFIG_AUX_DIR, 'autostuff'.
 183 libtoolize: copying file 'autostuff/ltmain.sh'
 184 libtoolize: putting macros in AC_CONFIG_MACRO_DIRS, 'm4'.
 185 libtoolize: copying file 'm4/libtool.m4'
 186 libtoolize: copying file 'm4/ltoptions.m4'
 187 libtoolize: copying file 'm4/ltsugar.m4'
 188 libtoolize: copying file 'm4/ltversion.m4'
 189 libtoolize: copying file 'm4/lt~obsolete.m4'
 190 autoreconf: running: /usr/bin/autoconf --force
 191 autoreconf: running: /usr/bin/autoheader --force
 192 autoreconf: running: automake --add-missing --copy --force-missing
 193 configure.ac:34: installing 'autostuff/ar-lib'
 194 configure.ac:34: installing 'autostuff/compile'
 195 configure.ac:36: installing 'autostuff/config.guess'
 196 configure.ac:36: installing 'autostuff/config.sub'
 197 configure.ac:32: installing 'autostuff/install-sh'
 198 configure.ac:32: installing 'autostuff/missing'
 199 Makefile.am: installing './INSTALL'
 200 Makefile.am: installing 'autostuff/depcomp'
 201 parallel-tests: installing 'autostuff/test-driver'
 202 autoreconf: Leaving directory `.'
 203 checking for a BSD-compatible install... /usr/bin/install -c
 204 checking whether build environment is sane... yes
 205 checking for a thread-safe mkdir -p... /bin/mkdir -p
 206 checking for gawk... no
 207 checking for mawk... mawk
 208 checking whether make sets $(MAKE)... yes
 209 checking whether make supports nested variables... yes
 210 checking whether make supports nested variables... (cached) yes
 211 checking for style of include used by make... GNU
 212 checking for gcc... gcc
 213 checking whether the C compiler works... yes
 214 checking for C compiler default output file name... a.out
 215 checking for suffix of executables... 
 216 checking whether we are cross compiling... no
 217 checking for suffix of object files... o
 218 checking whether we are using the GNU C compiler... yes
 219 checking whether gcc accepts -g... yes
 220 checking for gcc option to accept ISO C89... none needed
 221 checking whether gcc understands -c and -o together... yes
 222 checking dependency style of gcc... gcc3
 223 checking for ar... ar
 224 checking the archiver (ar) interface... ar
 225 checking build system type... i686-pc-linux-gnu
 226 checking host system type... i686-pc-linux-gnu
 227 checking for gcc... (cached) gcc
 228 checking whether we are using the GNU C compiler... (cached) yes
 229 checking whether gcc accepts -g... (cached) yes
 230 checking for gcc option to accept ISO C89... (cached) none needed
 231 checking whether gcc understands -c and -o together... (cached) yes
 232 checking dependency style of gcc... (cached) gcc3
 233 checking for g++... g++
 234 checking whether we are using the GNU C++ compiler... yes
 235 checking whether g++ accepts -g... yes
 236 checking dependency style of g++... gcc3
 237 checking whether ln -s works... yes
 238 checking whether make supports order-only prerequisites... yes
 239 checking how to print strings... printf
 240 checking for a sed that does not truncate output... /bin/sed
 241 checking for grep that handles long lines and -e... /bin/grep
 242 checking for egrep... /bin/grep -E
 243 checking for fgrep... /bin/grep -F
 244 checking for ld used by gcc... /usr/bin/ld
 245 checking if the linker (/usr/bin/ld) is GNU ld... yes
 246 checking for BSD- or MS-compatible name lister (nm)... /usr/bin/nm -B
 247 checking the name lister (/usr/bin/nm -B) interface... BSD nm
 248 checking the maximum length of command line arguments... 1572864
 249 checking how to convert i686-pc-linux-gnu file names to i686-pc-linux-gnu format... func_convert_file_noop
 250 checking how to convert i686-pc-linux-gnu file names to toolchain format... func_convert_file_noop
 251 checking for /usr/bin/ld option to reload object files... -r
 252 checking for objdump... objdump
 253 checking how to recognize dependent libraries... pass_all
 254 checking for dlltool... no
 255 checking how to associate runtime and link libraries... printf %s\n
 256 checking for archiver @FILE support... @
 257 checking for strip... strip
 258 checking for ranlib... ranlib
 259 checking command to parse /usr/bin/nm -B output from gcc object... ok
 260 checking for sysroot... no
 261 checking for a working dd... /bin/dd
 262 checking how to truncate binary pipes... /bin/dd bs=4096 count=1
 263 checking for mt... mt
 264 checking if mt is a manifest tool... no
 265 checking how to run the C preprocessor... gcc -E
 266 checking for ANSI C header files... yes
 267 checking for sys/types.h... yes
 268 checking for sys/stat.h... yes
 269 checking for stdlib.h... yes
 270 checking for string.h... yes
 271 checking for memory.h... yes
 272 checking for strings.h... yes
 273 checking for inttypes.h... yes
 274 checking for stdint.h... yes
 275 checking for unistd.h... yes
 276 checking for dlfcn.h... yes
 277 checking for objdir... .libs
 278 checking if gcc supports -fno-rtti -fno-exceptions... no
 279 checking for gcc option to produce PIC... -fPIC -DPIC
 280 checking if gcc PIC flag -fPIC -DPIC works... yes
 281 checking if gcc static flag -static works... yes
 282 checking if gcc supports -c -o file.o... yes
 283 checking if gcc supports -c -o file.o... (cached) yes
 284 checking whether the gcc linker (/usr/bin/ld) supports shared libraries... yes
 285 checking whether -lc should be explicitly linked in... no
 286 checking dynamic linker characteristics... GNU/Linux ld.so
 287 checking how to hardcode library paths into programs... immediate
 288 checking whether stripping libraries is possible... yes
 289 checking if libtool supports shared libraries... yes
 290 checking whether to build shared libraries... yes
 291 checking whether to build static libraries... yes
 292 checking how to run the C++ preprocessor... g++ -E
 293 checking for ld used by g++... /usr/bin/ld
 294 checking if the linker (/usr/bin/ld) is GNU ld... yes
 295 checking whether the g++ linker (/usr/bin/ld) supports shared libraries... yes
 296 checking for g++ option to produce PIC... -fPIC -DPIC
 297 checking if g++ PIC flag -fPIC -DPIC works... yes
 298 checking if g++ static flag -static works... yes
 299 checking if g++ supports -c -o file.o... yes
 300 checking if g++ supports -c -o file.o... (cached) yes
 301 checking whether the g++ linker (/usr/bin/ld) supports shared libraries... yes
 302 checking dynamic linker characteristics... (cached) GNU/Linux ld.so
 303 checking how to hardcode library paths into programs... immediate
 304 checking for pkg-config... /usr/bin/pkg-config
 305 checking pkg-config is at least version 0.22... yes
 306 checking for libserialport... yes
 307 checking for libftdi... yes
 308 checking for libusb... yes
 309 checking for librevisa... no
 310 checking for libgpib... no
 311 checking for libieee1284... no
 312 checking compiler flag for C99... -std=c99
 313 checking compiler flag for visibility... -fvisibility=hidden
 314 checking which C compiler warning flags to use... -Wall -Wextra -Wmissing-prototypes
 315 checking for special C compiler options needed for large files... no
 316 checking for _FILE_OFFSET_BITS value needed for large files... 64
 317 checking whether byte ordering is bigendian... no
 318 checking sys/mman.h usability... yes
 319 checking sys/mman.h presence... yes
 320 checking for sys/mman.h... yes
 321 checking sys/ioctl.h usability... yes
 322 checking sys/ioctl.h presence... yes
 323 checking for sys/ioctl.h... yes
 324 checking sys/timerfd.h usability... yes
 325 checking sys/timerfd.h presence... yes
 326 checking for sys/timerfd.h... yes
 327 checking for library containing pow... -lm
 328 checking for RPC support... yes
 329 checking for __int128_t... no
 330 checking for __uint128_t... no
 331 checking which C++ compiler warning flags to use... -Wall -Wextra
 332 checking whether g++ supports C++11 features by default... no
 333 checking whether g++ supports C++11 features with -std=c++11... yes
 334 checking for doxygen... yes
 335 checking for a Python interpreter with version >= 2.7... python
 336 checking for python... /usr/bin/python
 337 checking for python version... 2.7
 338 checking for python platform... linux2
 339 checking for python script directory... ${prefix}/lib/python2.7/site-packages
 340 checking for python extension module directory... ${exec_prefix}/lib/python2.7/site-packages
 341 checking for stoi and stod... yes
 342 checking python module: setuptools... yes
 343 checking python module: numpy... yes
 344 checking for swig... swig
 345 checking for swig version... 3.0.8
 346 checking for ruby... no
 347 checking for javac... yes
 348 checking for gcj... no
 349 checking for guavac... no
 350 checking for jikes... no
 351 checking for javac... javac
 352 checking if javac works... yes
 353 checking for javac... /usr/bin/javac
 354 checking symlink for /usr/bin/javac... /etc/alternatives/javac
 355 checking symlink for /etc/alternatives/javac... /usr/lib/jvm/java-8-openjdk-i386/bin/javac
 356 checking for /usr/lib/jvm/java-8-openjdk-i386/bin/include/jni.h... no
 357 checking for /usr/lib/jvm/java-8-openjdk-i386/include/jni.h... yes
 358 checking jni.h usability... yes
 359 checking jni.h presence... yes
 360 checking for jni.h... yes
 361 checking for LIBSIGROK... yes
 362 checking for TESTS... yes
 363 checking for LIBSIGROKCXX... yes
 364 checking for PYSIGROK... yes
 365 checking for RBSIGROK... yes
 366 Must specify package names on the command line
 367 Must specify package names on the command line
 368 Must specify package names on the command line
 369 checking for libusb_os_handle... no
 370 checking for zip_discard... yes
 371 checking that generated files are newer than configure... done
 372 configure: creating ./config.status
 373 config.status: creating Makefile
 374 config.status: creating libsigrok.pc
 375 config.status: creating bindings/cxx/libsigrokcxx.pc
 376 config.status: creating config.h
 377 config.status: creating include/libsigrok/version.h
 378 config.status: executing depfiles commands
 379 config.status: executing libtool commands
 380 
 381 libsigrok configuration summary:
 382  - Package version................. 0.5.0-git-d5794ad
 383  - Library ABI version............. 3:0:0
 384  - Prefix.......................... /home/rudi/sr
 385  - Building on..................... i686-pc-linux-gnu
 386  - Building for.................... i686-pc-linux-gnu
 387 
 388 Compile configuration:
 389  - C compiler...................... gcc
 390  - C compiler version.............. gcc (Ubuntu 5.4.0-6ubuntu1~16.04.2) 5.4.0 20160609
 391  - C compiler flags................ -g -O2
 392  - Additional C compiler flags..... -std=c99 -fvisibility=hidden
 393  - C compiler warnings............. -Wall -Wextra -Wmissing-prototypes
 394  - C++ compiler.................... g++ -std=c++11
 395  - C++ compiler version............ g++ (Ubuntu 5.4.0-6ubuntu1~16.04.2) 5.4.0 20160609
 396  - C++ compiler flags.............. -g -O2
 397  - C++ compiler warnings........... -Wall -Wextra
 398 
 399 Detected libraries (required):
 400  - glib-2.0 >= 2.32.0.............. 2.48.1
 401  - libzip >= 0.10.................. 1.0.1
 402 
 403 Detected libraries (optional):
 404  - libserialport >= 0.1.1.......... 0.1.1
 405  - libftdi1 >= 1.0................. no
 406  - libftdi >= 0.16................. 0.20
 407  - libusb-1.0 >= 1.0.16............ 1.0.20
 408  - librevisa >= 0.0.20130412....... no
 409  - libgpib......................... no
 410  - libieee1284..................... no
 411  - check >= 0.9.4.................. 0.10.0
 412  - glibmm-2.4 >= 2.32.0............ 2.46.3
 413  - python = 2.7.................... 2.7
 414  - pygobject-3.0 >= 3.0.0.......... 3.20.0
 415  - ruby............................ no
 416  - ruby-........................... no
 417 
 418 Enabled hardware drivers:
 419  - agilent-dmm..................... yes
 420  - appa-55ii....................... yes
 421  - arachnid-labs-re-load-pro....... yes
 422  - asix-sigma...................... yes
 423  - atten-pps3xxx................... yes
 424  - baylibre-acme................... yes
 425  - beaglelogic..................... yes
 426  - brymen-bm86x.................... yes
 427  - brymen-dmm...................... yes
 428  - cem-dt-885x..................... yes
 429  - center-3xx...................... yes
 430  - chronovu-la..................... yes
 431  - colead-slm...................... yes
 432  - conrad-digi-35-cpu.............. yes
 433  - deree-de5000.................... yes
 434  - demo............................ yes
 435  - fluke-dmm....................... yes
 436  - ftdi-la......................... yes
 437  - fx2lafw......................... yes
 438  - gmc-mh-1x-2x.................... yes
 439  - gwinstek-gds-800................ yes
 440  - hameg-hmo....................... yes
 441  - hantek-6xxx..................... yes
 442  - hantek-dso...................... yes
 443  - hp-3457a........................ yes
 444  - hung-chang-dso-2100............. no (missing: libieee1284)
 445  - ikalogic-scanalogic2............ yes
 446  - ikalogic-scanaplus.............. yes
 447  - kecheng-kc-330b................. yes
 448  - kern-scale...................... yes
 449  - korad-kaxxxxp................... yes
 450  - lascar-el-usb................... yes
 451  - lecroy-logicstudio.............. yes
 452  - manson-hcs-3xxx................. yes
 453  - maynuo-m97...................... yes
 454  - mic-985xx....................... yes
 455  - motech-lps-30x.................. yes
 456  - norma-dmm....................... yes
 457  - openbench-logic-sniffer......... yes
 458  - pce-322a........................ yes
 459  - pipistrello-ols................. yes
 460  - rigol-ds........................ yes
 461  - saleae-logic16.................. yes
 462  - scpi-pps........................ yes
 463  - serial-dmm...................... yes
 464  - sysclk-lwla..................... yes
 465  - teleinfo........................ yes
 466  - testo........................... yes
 467  - tondaj-sl-814................... yes
 468  - uni-t-dmm....................... yes
 469  - uni-t-ut32x..................... yes
 470  - victor-dmm...................... yes
 471  - yokogawa-dlm.................... yes
 472  - zeroplus-logic-cube............. yes
 473 
 474 Enabled SCPI backends:
 475  - TCP............................. yes
 476  - RPC............................. yes
 477  - serial.......................... yes
 478  - VISA............................ no
 479  - GPIB............................ no
 480  - USBTMC.......................... yes
 481 
 482 Enabled language bindings:
 483  - C++............................. yes
 484  - Python.......................... yes
 485  - Ruby............................ no (missing: Ruby, Headers)
 486  - Java............................ yes
 487 
 488 make  all-am
 489   CC       src/serial.lo
 490   CC       src/ezusb.lo
 491   CC       src/usb.lo
 492   CC       src/scpi/scpi_usbtmc_libusb.lo
 493   CC       src/drivers.lo
 494   GEN      doxy/xml/index.xml
 495   CC       src/backend.lo
 496   CC       src/device.lo
 497   CC       src/session.lo
 498   CC       src/session_file.lo
 499   CC       src/session_driver.lo
 500   CC       src/hwdriver.lo
 501   CC       src/trigger.lo
 502   CC       src/soft-trigger.lo
 503   CC       src/analog.lo
 504   CC       src/fallback.lo
 505   CC       src/resource.lo
 506   CC       src/strutil.lo
 507   CC       src/log.lo
 508   CC       src/version.lo
 509   CC       src/error.lo
 510   CC       src/std.lo
 511   CC       src/sw_limits.lo
 512   CC       src/input/input.lo
 513   CC       src/input/binary.lo
 514   CC       src/input/chronovu_la8.lo
 515   CC       src/input/csv.lo
 516   CC       src/input/raw_analog.lo
 517   CC       src/input/trace32_ad.lo
 518   CC       src/input/vcd.lo
 519   CC       src/input/wav.lo
 520   CC       src/output/output.lo
 521   CC       src/output/analog.lo
 522   CC       src/output/ascii.lo
 523   CC       src/output/bits.lo
 524   CC       src/output/binary.lo
 525   CC       src/output/csv.lo
 526   CC       src/output/chronovu_la8.lo
 527 ../src/output/csv.c: In function ‘dump_saved_values’:
 528 ../src/output/csv.c:442:34: warning: format ‘%lu’ expects argument of type ‘long unsigned int’, but argument 3 has type ‘uint64_t {aka long long unsigned int}’ [-Wformat=]
 529      g_string_append_printf(*out, "%lu%s",
 530                                   ^
 531   CC       src/output/wav.lo
 532   CC       src/output/hex.lo
 533   CC       src/output/ols.lo
 534   CC       src/output/srzip.lo
 535   CC       src/output/vcd.lo
 536   CC       src/transform/transform.lo
 537   CC       src/transform/nop.lo
 538   CC       src/transform/scale.lo
 539   CC       src/transform/invert.lo
 540   CC       src/scpi/scpi.lo
 541   CC       src/scpi/helpers.lo
 542   CC       src/scpi/scpi_tcp.lo
 543   CC       src/scpi/scpi_vxi.lo
 544   CC       src/scpi/vxi_clnt.lo
 545   CC       src/scpi/vxi_xdr.lo
 546   CC       src/scpi/scpi_serial.lo
 547   CC       src/modbus/modbus.lo
 548   CC       src/modbus/modbus_serial_rtu.lo
 549   CC       src/dmm/es519xx.lo
 550   CC       src/dmm/fs9721.lo
 551   CC       src/dmm/fs9922.lo
 552   CC       src/dmm/m2110.lo
 553   CC       src/dmm/metex14.lo
 554   CC       src/dmm/rs9lcd.lo
 555   CC       src/dmm/bm25x.lo
 556   CC       src/dmm/ut71x.lo
 557   CC       src/dmm/ut372.lo
 558   CC       src/dmm/vc870.lo
 559   CC       src/dmm/dtm0660.lo
 560   CC       src/lcr/es51919.lo
 561   CC       src/scale/kern.lo
 562   CC       src/hardware/agilent-dmm/api.lo
 563   CC       src/hardware/agilent-dmm/sched.lo
 564   CC       src/hardware/appa-55ii/protocol.lo
 565   CC       src/hardware/appa-55ii/api.lo
 566   CC       src/hardware/arachnid-labs-re-load-pro/protocol.lo
 567   CC       src/hardware/arachnid-labs-re-load-pro/api.lo
 568   CC       src/hardware/asix-sigma/protocol.lo
 569   CC       src/hardware/asix-sigma/api.lo
 570   CC       src/hardware/atten-pps3xxx/protocol.lo
 571   CC       src/hardware/atten-pps3xxx/api.lo
 572   CC       src/hardware/baylibre-acme/protocol.lo
 573   CC       src/hardware/baylibre-acme/api.lo
 574   CC       src/hardware/baylibre-acme/gpio.lo
 575   CC       src/hardware/beaglelogic/protocol.lo
 576   CC       src/hardware/beaglelogic/api.lo
 577   CC       src/hardware/brymen-bm86x/protocol.lo
 578   CC       src/hardware/brymen-bm86x/api.lo
 579   CC       src/hardware/brymen-dmm/parser.lo
 580   CC       src/hardware/brymen-dmm/protocol.lo
 581   CC       src/hardware/brymen-dmm/api.lo
 582   CC       src/hardware/cem-dt-885x/protocol.lo
 583   CC       src/hardware/cem-dt-885x/api.lo
 584   CC       src/hardware/center-3xx/protocol.lo
 585   CC       src/hardware/center-3xx/api.lo
 586   CC       src/hardware/chronovu-la/protocol.lo
 587   CC       src/hardware/chronovu-la/api.lo
 588   CC       src/hardware/colead-slm/protocol.lo
 589   CC       src/hardware/colead-slm/api.lo
 590   CC       src/hardware/conrad-digi-35-cpu/protocol.lo
 591   CC       src/hardware/conrad-digi-35-cpu/api.lo
 592   CC       src/hardware/demo/demo.lo
 593   CC       src/hardware/deree-de5000/api.lo
 594   CC       src/hardware/fluke-dmm/fluke.lo
 595   CC       src/hardware/fluke-dmm/api.lo
 596   CC       src/hardware/ftdi-la/protocol.lo
 597   CC       src/hardware/ftdi-la/api.lo
 598 ../src/hardware/ftdi-la/api.c: In function ‘scan_device’:
 599 ../src/hardware/ftdi-la/api.c:122:35: warning: passing argument 2 of ‘ftdi_usb_get_strings’ from incompatible pointer type [-Wincompatible-pointer-types]
 600   rv = ftdi_usb_get_strings(ftdic, dev, vendor, 32,
 601                                    ^
 602 In file included from ../src/hardware/ftdi-la/api.c:21:0:
 603 /usr/include/ftdi.h:376:9: note: expected ‘struct usb_device *’ but argument is of type ‘struct libusb_device *’
 604      int ftdi_usb_get_strings(struct ftdi_context *ftdi, struct usb_device *dev,
 605          ^
 606 ../src/hardware/ftdi-la/api.c: In function ‘scan_all’:
 607 ../src/hardware/ftdi-la/api.c:185:22: warning: passing argument 2 of ‘scan_device’ from incompatible pointer type [-Wincompatible-pointer-types]
 608    scan_device(ftdic, curdev->dev, &devices);
 609                       ^
 610 ../src/hardware/ftdi-la/api.c:85:13: note: expected ‘struct libusb_device *’ but argument is of type ‘struct usb_device *’
 611  static void scan_device(struct ftdi_context *ftdic,
 612              ^
 613   CC       src/hardware/fx2lafw/protocol.lo
 614   CC       src/hardware/fx2lafw/api.lo
 615   CC       src/hardware/fx2lafw/dslogic.lo
 616   CC       src/hardware/gmc-mh-1x-2x/protocol.lo
 617   CC       src/hardware/gmc-mh-1x-2x/api.lo
 618   CC       src/hardware/gwinstek-gds-800/protocol.lo
 619   CC       src/hardware/gwinstek-gds-800/api.lo
 620   CC       src/hardware/hameg-hmo/protocol.lo
 621   CC       src/hardware/hameg-hmo/api.lo
 622   CC       src/hardware/hantek-6xxx/protocol.lo
 623   CC       src/hardware/hantek-6xxx/api.lo
 624   CC       src/hardware/hantek-dso/dso.lo
 625   CC       src/hardware/hantek-dso/api.lo
 626   CC       src/hardware/hp-3457a/protocol.lo
 627   CC       src/hardware/hp-3457a/api.lo
 628   CC       src/hardware/ikalogic-scanalogic2/protocol.lo
 629   CC       src/hardware/ikalogic-scanalogic2/api.lo
 630   CC       src/hardware/ikalogic-scanaplus/protocol.lo
 631   CC       src/hardware/ikalogic-scanaplus/api.lo
 632   CC       src/hardware/kecheng-kc-330b/protocol.lo
 633   CC       src/hardware/kecheng-kc-330b/api.lo
 634   CC       src/hardware/kern-scale/protocol.lo
 635   CC       src/hardware/kern-scale/api.lo
 636   CC       src/hardware/korad-kaxxxxp/protocol.lo
 637   CC       src/hardware/korad-kaxxxxp/api.lo
 638   CC       src/hardware/lascar-el-usb/protocol.lo
 639   CC       src/hardware/lascar-el-usb/api.lo
 640   CC       src/hardware/lecroy-logicstudio/protocol.lo
 641   CC       src/hardware/lecroy-logicstudio/api.lo
 642   CC       src/hardware/manson-hcs-3xxx/protocol.lo
 643   CC       src/hardware/manson-hcs-3xxx/api.lo
 644   CC       src/hardware/maynuo-m97/protocol.lo
 645   CC       src/hardware/maynuo-m97/api.lo
 646   CC       src/hardware/mic-985xx/protocol.lo
 647   CC       src/hardware/mic-985xx/api.lo
 648   CC       src/hardware/motech-lps-30x/protocol.lo
 649   CC       src/hardware/motech-lps-30x/api.lo
 650   CC       src/hardware/norma-dmm/protocol.lo
 651   CC       src/hardware/norma-dmm/api.lo
 652   CC       src/hardware/openbench-logic-sniffer/protocol.lo
 653   CC       src/hardware/openbench-logic-sniffer/api.lo
 654   CC       src/hardware/pce-322a/protocol.lo
 655   CC       src/hardware/pce-322a/api.lo
 656   CC       src/hardware/pipistrello-ols/protocol.lo
 657   CC       src/hardware/pipistrello-ols/api.lo
 658   CC       src/hardware/rigol-ds/protocol.lo
 659   CC       src/hardware/rigol-ds/api.lo
 660   CC       src/hardware/saleae-logic16/protocol.lo
 661   CC       src/hardware/saleae-logic16/api.lo
 662   CC       src/hardware/scpi-pps/protocol.lo
 663   CC       src/hardware/scpi-pps/profiles.lo
 664   CC       src/hardware/scpi-pps/api.lo
 665   CC       src/hardware/serial-dmm/protocol.lo
 666   CC       src/hardware/serial-dmm/api.lo
 667   CC       src/hardware/sysclk-lwla/lwla.lo
 668   CC       src/hardware/sysclk-lwla/lwla1016.lo
 669   CC       src/hardware/sysclk-lwla/lwla1034.lo
 670   CC       src/hardware/sysclk-lwla/protocol.lo
 671   CC       src/hardware/sysclk-lwla/api.lo
 672   CC       src/hardware/teleinfo/protocol.lo
 673   CC       src/hardware/teleinfo/api.lo
 674   CC       src/hardware/testo/protocol.lo
 675   CC       src/hardware/testo/api.lo
 676   CC       src/hardware/tondaj-sl-814/protocol.lo
 677   CC       src/hardware/tondaj-sl-814/api.lo
 678   CC       src/hardware/uni-t-dmm/protocol.lo
 679   CC       src/hardware/uni-t-dmm/api.lo
 680   CC       src/hardware/uni-t-ut32x/protocol.lo
 681   CC       src/hardware/uni-t-ut32x/api.lo
 682   CC       src/hardware/victor-dmm/protocol.lo
 683   CC       src/hardware/victor-dmm/api.lo
 684   CC       src/hardware/yokogawa-dlm/protocol.lo
 685   CC       src/hardware/yokogawa-dlm/protocol_wrappers.lo
 686   CC       src/hardware/yokogawa-dlm/api.lo
 687   CC       src/hardware/zeroplus-logic-cube/analyzer.lo
 688   CC       src/hardware/zeroplus-logic-cube/gl_usb.lo
 689   CC       src/hardware/zeroplus-logic-cube/protocol.lo
 690   CC       src/hardware/zeroplus-logic-cube/api.lo
 691   GEN      bindings/cxx/enums.timestamp
 692   CXX      bindings/cxx/classes.lo
 693   GEN      bindings/cxx/doxy/xml/index.xml
 694   CCLD     src/libdrivers.la
 695 copying selected object files to avoid basename conflicts...
 696 ar: `u' modifier ignored since `D' is the default (see `U')
 697   GEN      bindings/python/sigrok/core/doc_start.i
 698   GEN      bindings/python/sigrok/core/doc_end.i
 699   GEN      bindings/java/org/sigrok/core/classes/doc.i
 700   CCLD     src/libdrivers.o
 701   GEN      bindings/java/org/sigrok/core/classes/classes_wrap.cxx
 702   GEN      src/libdrivers.lo
 703   GEN      bindings/java/sigrok-core.jar
 704   CCLD     libsigrok.la
 705 copying selected object files to avoid basename conflicts...
 706 ar: `u' modifier ignored since `D' is the default (see `U')
 707   CXXLD    bindings/cxx/libsigrokcxx.la
 708 ar: `u' modifier ignored since `D' is the default (see `U')
 709   GEN      bindings/java/libsigrok_java_core_classes.so
 710   GEN      bindings/python/timestamp
 711 destdir=''; /usr/bin/python ../bindings/python/setup.py VERSION='0.5.0' CC='g++ -std=c++11' CFLAGS='-g -O2 -Wall -Wextra -std=c++11 -I/usr/include/python2.7 -I/usr/include/i386-linux-gnu/python2.7 -I/usr/include/pygobject-3.0 -I/usr/include/glibmm-2.4 -I/usr/lib/i386-linux-gnu/glibmm-2.4/include -I/usr/include/glib-2.0 -I/usr/lib/i386-linux-gnu/glib-2.0/include -I/usr/include/sigc++-2.0 -I/usr/lib/i386-linux-gnu/sigc++-2.0/include' CXXFLAGS='-g -O2 -Wall -Wextra -std=c++11 -I/usr/include/python2.7 -I/usr/include/i386-linux-gnu/python2.7 -I/usr/include/pygobject-3.0 -I/usr/include/glibmm-2.4 -I/usr/lib/i386-linux-gnu/glibmm-2.4/include -I/usr/include/glib-2.0 -I/usr/lib/i386-linux-gnu/glib-2.0/include -I/usr/include/sigc++-2.0 -I/usr/lib/i386-linux-gnu/sigc++-2.0/include' LDADD='-lpython2.7 -lglibmm-2.4 -lgobject-2.0 -lglib-2.0 -lsigc-2.0' --quiet install ${destdir:+"--root=$destdir"} \
 712 	--prefix "/home/rudi/sr" --exec-prefix "/home/rudi/sr"
 713 warning: manifest_maker: standard file 'setup.py' not found
 714 
 715 /usr/bin/install -c -d /home/rudi/sr/lib/jni
 716 /usr/bin/install -c bindings/java/libsigrok_java_core_classes.so /home/rudi/sr/lib/jni
 717 /usr/bin/install -c -d /home/rudi/sr/share/java
 718 /usr/bin/install -c bindings/java/sigrok-core.jar /home/rudi/sr/share/java
 719  /bin/mkdir -p '/home/rudi/sr/lib'
 720  /bin/bash ./libtool --silent  --mode=install /usr/bin/install -c   libsigrok.la bindings/cxx/libsigrokcxx.la '/home/rudi/sr/lib'
 721 libtool: warning: relinking 'bindings/cxx/libsigrokcxx.la'
 722  /bin/mkdir -p '/home/rudi/sr/include/libsigrokcxx'
 723  /usr/bin/install -c -m 644 ../bindings/cxx/include/libsigrokcxx/libsigrokcxx.hpp '/home/rudi/sr/include/libsigrokcxx'
 724  /bin/mkdir -p '/home/rudi/sr/include/libsigrok'
 725  /usr/bin/install -c -m 644 ../include/libsigrok/libsigrok.h ../include/libsigrok/proto.h '/home/rudi/sr/include/libsigrok'
 726  /bin/mkdir -p '/home/rudi/sr/include/libsigrokcxx'
 727  /usr/bin/install -c -m 644 bindings/cxx/include/libsigrokcxx/enums.hpp '/home/rudi/sr/include/libsigrokcxx'
 728  /bin/mkdir -p '/home/rudi/sr/include/libsigrok'
 729  /usr/bin/install -c -m 644 include/libsigrok/version.h '/home/rudi/sr/include/libsigrok'
 730  /bin/mkdir -p '/home/rudi/sr/lib/pkgconfig'
 731  /usr/bin/install -c -m 644 libsigrok.pc bindings/cxx/libsigrokcxx.pc '/home/rudi/sr/lib/pkgconfig'
 732 make  tests/main
 733   CC       tests/lib.o
 734   CC       tests/main.o
 735   CC       tests/core.o
 736   CC       tests/input_all.o
 737   CC       tests/input_binary.o
 738   CC       tests/output_all.o
 739   CC       tests/transform_all.o
 740   CC       tests/session.o
 741   CC       tests/strutil.o
 742   CC       tests/version.o
 743   CC       tests/driver_all.o
 744   CC       tests/device.o
 745   CC       tests/trigger.o
 746   CC       tests/analog.o
 747   CCLD     tests/main
 748 make  check-TESTS
 749 FAIL: tests/main
 750 ============================================================================
 751 Testsuite summary for libsigrok 0.5.0
 752 ============================================================================
 753 # TOTAL: 1
 754 # PASS:  0
 755 # SKIP:  0
 756 # XFAIL: 0
 757 # FAIL:  1
 758 # XPASS: 0
 759 # ERROR: 0
 760 ============================================================================
 761 See ./test-suite.log
 762 Please report to sigrok-devel@lists.sourceforge.net
 763 ============================================================================
 764 Makefile:3174: die Regel für Ziel „test-suite.log“ scheiterte
 765 make[2]: *** [test-suite.log] Fehler 1
 766 Makefile:3280: die Regel für Ziel „check-TESTS“ scheiterte
 767 make[1]: *** [check-TESTS] Fehler 2
 768 Makefile:3495: die Regel für Ziel „check-am“ scheiterte
 769 make: *** [check-am] Fehler 2
 770 
 771 ---- end of sigrok git check -----

Attached Files

To refer to attachments on a page, use attachment:filename, as shown below in the list of files. Do NOT use the URL of the [get] link, since this is subject to change and can break easily.
  • [get | view] (2016-09-07 18:06:00, 6.2 KB) [[attachment:ir_nec_tv_matsui_av_hold.sr]]
  • [get | view] (2016-09-07 18:08:00, 7.9 KB) [[attachment:pd.py]]
  • [get | view] (2016-09-13 15:57:00, 33.9 KB) [[attachment:sigrok_Ubuntu1604-32_git-test.txt]]
  • [get | view] (2016-09-07 17:33:00, 67.2 KB) [[attachment:sigrok_decoder_ir_nec2.png]]
  • [get | view] (2016-09-07 19:14:00, 44.4 KB) [[attachment:sigrok_decoder_ir_nec_options.png]]
  • [get | view] (2016-09-07 17:33:00, 21.2 KB) [[attachment:winpdb_attach.PNG]]
  • [get | view] (2016-09-07 17:33:00, 126.6 KB) [[attachment:winpdb_decoder_ir_nec2.PNG]]
 All files | Selected Files: delete move to page copy to page

You are not allowed to attach a file to this page.